gulp events js 72 throw er unhandled error event

 

 

 

 

events.js:72.Generally what Ive seen with EACCES errors is either. Permission issues. You already have gulp watch running in another process/tab. [12:55:21] Violation found in dependency: underscore - The operator was found but the policy doesnt include it. events.js:72. Error in plugin gulp-semverify. There were policy violations with one or more of your dependencies. 17/08/2015 Catching errors on Gulp.js. subscribe on error event and dont allow to throw unhandled exception: now gulp can get only error from last stream, javascript - Nicely throwing an error in How to catch errors without stopping gulp.watch events.js:72 throw er events.js is from browserify I think. Any ideas what I have to do?But when adding installing react-d3 via npm (the updated version, directly downloaded from my private git server), i can not build my project with gulp. Everytime I execute gulp all I get this error message not sure why is that.[11:31:20] Finished all after 17 s [11:31:20] gulp-inject 3 files into index.html. events.js:141. When I run the application with: node app.js, I have the following errors: events.js:72 throw erError: listen EADDRINUSE at errnoException (net.

js:884:11) at Server.listen2 (net. js:1022:14) atOtherwise, youll likely get the same error. In the express skeletons app.

js file youll notice line 15 A task named html throws an error. Here is the part of error code of it. bogon:toClient work gulp html (node:2519) fs: re-evaluating native module sources is not supported. First and foremost: upgrade your Node.js (and thus NPM) install to the latest version. After that, clear out the nodemodules folder, clear the node cache and reinstall the node modules.Cryptload Unhandled Error 1 says A task named html throws an error. Here is the part of error code of it. bogon:toClient work gulp html (node:2519) fs: re-evaluating native module sources is not supported.If you are using the graceful-fs module, please update it to a more recent version. events.js:160. I am getting folowing issue when i am trying to run the gulp. I am using laravel 5.2 and gulp 3.9.1 [16:40:58] Using gulpfile /var/www/html/embassy/embassyv1/gulpfile. js [16:40:58] Starting build I am getting an "Unhandled error event" while running gulp: events.js :141.Ive found the error is caused by that function in my gulpfile.js: var taskResizeSprite2x function() return gulp.src(config.paths.source.sprite /2x.png). events.js:72 throw er // unhandled error event. When I run the application with: node app.js, I have the following errorsnodejsevents.js:72.events.js:141 throw er . netstat -anp tcp | grep 9000 killall -9 node. wlchn. Search This Blog. node.js - How to fix Unhandled error event. Broken import declaration of "A" while using Gulp? ive been happily compiling using gulp.js afternoon started getting error: events.js:72 throw erjava.awt.event.keylistener import java.awt.image.bufferedimage i Home Forums Scripting NodeJS Tutorials NodeJS [SOLVED]: ExpressJS throw erWhen I run the application with: node app.js, I have the following errors: events.js:72 throw erError: listen EADDRINUSE at errnoException (net.js:884:11) at Server.listen2 (net. js:1022:14) at listen (net.js Everytime I execute gulp all I get this error message not sure why is that. events.js:141.Error: js/sample.min.js: error: couldnt process source due to parse error Unexpected character (38235:0). I am getting folowing issue when i am trying to run the gulp. I am using laravel 5.2 and gulp 3.9.1. [16:40:58] Using gulpfile /var/www/html/embassy/embassyv1/gulpfile. js [16:40:58] Startinggetting a nullPointer error when trying to use androids string resources to populate a spinner (311). Anonymous. Default gulp.task(default, [clean], function() gulp.start(build) ) I am getting following error on terminal, thinks path is picking wrong dont know where i made mistakeNode.js throws er Unhandled error event.am on windows running serverless 1. 6. The command killall -9 node returns "node: no process found" and there is nothing Dec 23, 2016 start the sample locally: events.1. Error: spawn Jun 5, 2015 I have tried reinstalling node (clearing cache after uninstall), a fresh install of Sage 8. js:160 throw er Add Fav. Since yesterday, gulp throws unhandled error event[11:41:02] Finished default after 323 ms events.js:141. A task named html throws an error. Here is the part of error code of it. bogon:toClient work gulp html (node:2519) fs: re-evaluating native module sources is not supported.Questions: Answers: I had similar problem with events.js. [19:59:06] Starting jekyll-async events.js:72 throw er Nonetheless, gulp-ruby-sass now prints the afore stated error when I try to run it.httppath "/" cssdir "css" sassdir "scss" imagesdir "img" javascriptsdir "js" fontsdir "css/fonts" fontsdir "iWantToStudyEngineering/css/fonts". events.js:85.gulp. ENOENT errors indicate that the file doesnt exist. Double check if sass executables are installed and available in the PATH. javascript - Unhandled error event with gulp uglify.javascript - Gulp / Unhandled stream error in pipe. Newest. node.js - Render react component on node server, with webpack. After installing Ionic Box to try to fix issues with cordova plugins, I get these errors for ionic serve etc. (Ive already shutdown all the VMs, afaik.error event Error: spawn ENOENT at errnoException (childprocess.js:1011:11) at Process.ChildProcess.handle.onexit (childprocess. js:802:34) RoverMR Node.js - events js 72 throw er unhandled error event.Gulp uglify fails with error js parse. [16:40:58] Using gulpfile /var/www/html/embassy/embassyv1/gulpfile.js [16:40:58] Starting buildI recently upgraded my project to Django 2.0, and an error started cropping up. First off, I use django gulp to start a gulp process whenever I start the django runserver. Tags: Javascript / DHTML. I started digging into Node.js recently as a means to understand why my Gulp.js build script wasnt working.As you can see, the emitted event is being thrown() in the events.js module, line 72. node --debug server.js. I got this error: events.js:72. Error: listen EADDRINUSE. at errnoException (net.js:905:11). A task named html throws an error. Here is the part of error code of it. bogon:toClient work gulp html (node:2519) fs: re-evaluating native module sources is not supported.I had similar problem with events.js. How to load script file dynamically in app.component.ts(angular)? Error loading "npm:babel-core5.5.6/browser. js".The whole gulp workflow was working fine until today i got this error: events.js:141. Everytime I execute gulp all I get this error message not sure why is that. events.js:141.Error: js/sample.min.js: error: couldnt process source due to parse error Unexpected character (38235:0). Catching errors on Gulp.js. Watch mode is important thing of modern build systems, especially for front-end. Gulp also has this feature but with a few caveats, which makes work more difficult.First, subscribe on error event and dont allow to throw unhandled exception events.js:72.This happened the first time I ran Yeoman after setting up my environment. I just got the same error with Yeoman. The default gulp task is clean. Gulpfile.js unhandled error event. 1. gulp js gave the error when i changed my js files| throw er. 0. gulp compass throws error. 1. gulp: How do i pipe a css file in between scss files? gulp.src([sassfile1.scss, cssfile.css ,sassfile2.scss]). I am getting folowing issue when i am trying to run the gulp. I am using laravel 5.2 and gulp 3.9.1. [16:40:58] Using gulpfile /var/www/html/embassy/embassyv1/gulpfile. js [16:40:58] Starting build Gulp Throws Error. Published 2 years ago by Presto.[22:21:36] Running Sass: resources/assets/sass/app.scss [22:21:36] Running Sass: resources/assets/sass/vendor/pricingtable.scss [22:21:36] Finished default after 188 ms stream. js:94.url consolelogs or c to enable/disable console log output serverlogs or s to enable/disable server log output quit or q to shutdown the server and exit events.js:72 throwCordova reference error on Ionic application with push How to fix the screen orientation for inappbrowser Ripple emulator failing to node streams.js. events.js:72. node streams.js. error [Error: ENOENT, open /Users/bunlong/js/gulp/contents/OMGWRONGFILE.html] errno: -2, code: ENOENT, pathPosted by Bunlong Van Oct 10th, 2016 Gulp. I got this error while executing gulp build. Any idea about this error or to find the exact error .[12:19:37] dist/ maps/styles/vendor-7ddea9127c.css.map 59.83 kB. events. js:141 throw erError: scripts/vendor-cd3b0d9620.js: error: couldnt process source due to parse error import and export Error was as-. events.js:72.Error: watch ENOSPC. To resolve that I did following as-.

1). npm install typescript save. events.js:72.Have to run gulp more than once to get Style changes. Gulp start creating errors instead of creating a DIst folder. Node.js/Gulp: child process spawn Error: spawn EACCES. events.js:72.Here is my gulpfile. I thought I had all the errors handled, but I guess I missed something. Gulpfiles are so confusing var gulp require(gulp) var minifycss require(gulp-cssnano) var autoprefixer require( gulp-autoprefixer) var notify require Unhandled error. I just recently copied over my local gulpfile and packages to a server in order to compile sass on the server instead of having to copy the file over everytime I make a change.events.js:72. gulp gulp-load-plugins javascript node-modules node.js.Modify file in place (same dest) using Gulp.js and a globbing pattern. How to save a stream into multiple destinations with Gulp.js?I had similar problem with events.js. [19:59:06] Starting jekyll-async events.js:72 throw er gulp-plumber, custom error handler, gulp-prettyerror. As an intermediate javascript developer, you may using gulp these days a great and straightforward streaming build system with a lot of advantages compared to grunt.events.js:141. events.js:72.This happened the first time I ran Yeoman after setting up my environment. I just got the same error with Yeoman. The default gulp task is clean. events.js:72.Having this attribute and using any file task like gulp-concat or gulp-cssmin for generating frontend assets results in error. TFS tooling for Visual Studio pick up all new files in solution and adds them to source control. at dns.js:72:18. at process.tickCallback (node.js:415:13).Apparently, you are trying to run an application which listens on a port and an application is already listening to that port (thats the basic issue for this error message). line 1208 col 72 Expected and instead saw .49 warnings. [15:13:42] Plumber found unhandled error: Error: EACCES: permission denied, open /Users/user/Documents/Projects/project-x/public/assets/ js/app-load.js events.js:141.

new posts